openldap-bugs

openldap-bugs@openldap.org
  • 47 participants
  • 298 discussions
Re: (ITS#5967) build failure with openssl : error: structure has no member named `ldo_tls_crlcheck'
by adrien.futschik@atosorigin.com
12 years, 9 months
(ITS#5971) Debug mode "fixes" authentication issue
by ngarratt@gmail.com
12 years, 9 months
(ITS#5970) slapd
by wmoreno3@yahoo.com
12 years, 9 months
(ITS#5969) Update consumers csn when providers change
by rein@OpenLDAP.org
12 years, 9 months
Re: (ITS#5968) slapd accepts RDN cn=one+cn=two
by ando@sys-net.it
12 years, 9 months
Re: (ITS#5963) Explictly deleting all object classes and re-add some fails in modify request
by ando@sys-net.it
12 years, 9 months
Re: (ITS#5967) build failure with openssl : error: structure has no member named `ldo_tls_crlcheck'
by quanah@zimbra.com
12 years, 9 months
Re: (ITS#5967) build failure with openssl : error: structure has no member named `ldo_tls_crlcheck'
by adrien.futschik@atosorigin.com
12 years, 9 months
Re: ITS#5965
by evaristojosec@yahoo.es
12 years, 9 months
Re: (ITS#5967) build failure with openssl : error: structure has no member named `ldo_tls_crlcheck'
by adrien.futschik@atosorigin.com
12 years, 9 months
Results per page: